Reaction Details
TargetTyrosine-protein kinase JAK1
LigandBDBM103728
Substrate/Competitorn/a
Meas. Tech.ChEMBL_1432584 (CHEMBL3388143)
IC50 92±n/a nM
Citation Menet, CJFletcher, SRVan Lommen, GGeney, RBlanc, JSmits, KJouannigot, NDeprez, Pvan der Aar, EMClement-Lacroix, PLepescheux, LGalien, RVayssiere, BNelles, LChristophe, TBrys, RUhring, MCiesielski, FVan Rompaey, L Triazolopyridines as selective JAK1 inhibitors: from hit identification to GLPG0634. J Med Chem57:9323-42 (2014) 
 
Tyrosine-protein kinase JAK1
Name:Tyrosine-protein kinase JAK1
Type:Protein
Mol. Mass.:133293.73
Organism:Homo sapiens (Human)
Description:P23458
Residue:1154
BDBM103728
NameBDBM103728
Synonyms:US10206907, Compound 18 US8563545, 2
TypeSmall organic molecule
Emp. Form.C21H23N5O2
Mol. Mass.377.4396
SMILESO=C(Nc1nc2cccc(-c3ccc(CN4CCOCC4)cc3)n2n1)C1CC1