Reaction Details
TargetTyrosine-protein kinase JAK1
LigandBDBM103737
Substrate/Competitorn/a
Meas. Tech.ChEMBL_1432584 (CHEMBL3388143)
IC50 27±n/a nM
Citation Menet, CJFletcher, SRVan Lommen, GGeney, RBlanc, JSmits, KJouannigot, NDeprez, Pvan der Aar, EMClement-Lacroix, PLepescheux, LGalien, RVayssiere, BNelles, LChristophe, TBrys, RUhring, MCiesielski, FVan Rompaey, L Triazolopyridines as selective JAK1 inhibitors: from hit identification to GLPG0634. J Med Chem57:9323-42 (2014) 
 
Tyrosine-protein kinase JAK1
Name:Tyrosine-protein kinase JAK1
Type:Protein
Mol. Mass.:133293.73
Organism:Homo sapiens (Human)
Description:P23458
Residue:1154
BDBM103737
NameBDBM103737
Synonyms:US10206907, Compound 234 US8563545, 11
TypeSmall organic molecule
Emp. Form.C22H23F2N5O
Mol. Mass.411.4477
SMILESFC1(F)CCN(Cc2ccc(cc2)-c2cccc3nc(NC(=O)C4CC4)nn23)CC1