Reaction Details
TargetSerine/threonine-protein kinase TBK1
LigandBDBM50031747
Substrate/Competitorn/a
Meas. Tech.ChEMBL_1432600 (CHEMBL3388159)
IC50>4000±n/a nM
Citation Menet, CJFletcher, SRVan Lommen, GGeney, RBlanc, JSmits, KJouannigot, NDeprez, Pvan der Aar, EMClement-Lacroix, PLepescheux, LGalien, RVayssiere, BNelles, LChristophe, TBrys, RUhring, MCiesielski, FVan Rompaey, L Triazolopyridines as selective JAK1 inhibitors: from hit identification to GLPG0634. J Med Chem57:9323-42 (2014) 
 
Serine/threonine-protein kinase TBK1
Name:Serine/threonine-protein kinase TBK1
Type:protein
Mol. Mass.:83645.20
Organism:Homo sapiens (Human)
Description:Q9UHD2
Residue:729
BDBM50031747
NameBDBM50031747
Synonyms:CHEMBL3360318
TypeSmall organic molecule
Emp. Form.C17H16N4O2
Mol. Mass.308.3345
SMILESCOc1ccc(cc1)-c1cccc2nc(NC(=O)C3CC3)nn12