Reaction Details
TargetTyrosine-protein kinase JAK1
LigandBDBM50031752
Substrate/Competitorn/a
Meas. Tech.ChEMBL_1432584 (CHEMBL3388143)
IC50 5740±n/a nM
Citation Menet, CJFletcher, SRVan Lommen, GGeney, RBlanc, JSmits, KJouannigot, NDeprez, Pvan der Aar, EMClement-Lacroix, PLepescheux, LGalien, RVayssiere, BNelles, LChristophe, TBrys, RUhring, MCiesielski, FVan Rompaey, L Triazolopyridines as selective JAK1 inhibitors: from hit identification to GLPG0634. J Med Chem57:9323-42 (2014) 
 
Tyrosine-protein kinase JAK1
Name:Tyrosine-protein kinase JAK1
Type:Protein
Mol. Mass.:133293.73
Organism:Homo sapiens (Human)
Description:P23458
Residue:1154
BDBM50031752
NameBDBM50031752
Synonyms:CHEMBL3352896
TypeSmall organic molecule
Emp. Form.C16H16N4O3S
Mol. Mass.344.388
SMILESCOc1ccc(cc1)-c1cccc2nc(NS(=O)(=O)C3CC3)nn12