Reaction Details
TargetEctonucleotide pyrophosphatase/phosphodiesterase family member 1
LigandBDBM50031817
Substrate/Competitorn/a
Meas. Tech.ChEMBL_1437888 (CHEMBL3384852)
Ki 36±n/a nM
Citation Chang, LLee, SYLeonczak, PRozenski, JDe Jonghe, SHanck, TMüller, CEHerdewijn, P Imidazopyridine- and purine-thioacetamide derivatives: potent inhibitors of nucleotide pyrophosphatase/phosphodiesterase 1 (NPP1). J Med Chem57:10080-100 (2014) 
 
Ectonucleotide pyrophosphatase/phosphodiesterase family member 1
Name:Ectonucleotide pyrophosphatase/phosphodiesterase family member 1
Type:PROTEIN
Mol. Mass.:104934.43
Organism:Homo sapiens (Human)
Description:ChEMBL_1448940
Residue:925
BDBM50031817
NameBDBM50031817
Synonyms:CHEMBL3360901
TypeSmall organic molecule
Emp. Form.C15H15N5O5S
Mol. Mass.377.375
SMILESCOc1ccc(NC(=O)CSc2nc3c([nH]2)[nH]c(=O)[nH]c3=O)cc1OC