Reaction Details
TargetEctonucleotide pyrophosphatase/phosphodiesterase family member 1
LigandBDBM50031822
Substrate/Competitorn/a
Meas. Tech.ChEMBL_1437890 (CHEMBL3384854)
Ki 1010±n/a nM
Citation Chang, LLee, SYLeonczak, PRozenski, JDe Jonghe, SHanck, TMüller, CEHerdewijn, P Imidazopyridine- and purine-thioacetamide derivatives: potent inhibitors of nucleotide pyrophosphatase/phosphodiesterase 1 (NPP1). J Med Chem57:10080-100 (2014) 
 
Ectonucleotide pyrophosphatase/phosphodiesterase family member 1
Name:Ectonucleotide pyrophosphatase/phosphodiesterase family member 1
Type:PROTEIN
Mol. Mass.:104934.43
Organism:Homo sapiens (Human)
Description:ChEMBL_1448940
Residue:925
BDBM50031822
NameBDBM50031822
Synonyms:CHEMBL3360895
TypeSmall organic molecule
Emp. Form.C17H20N6O4S
Mol. Mass.404.444
SMILESCCOc1nc(N)nc2[nH]c(SCC(=O)Nc3ccc(OC)c(OC)c3)nc12