Reaction Details
TargetEctonucleotide pyrophosphatase/phosphodiesterase family member 1
LigandBDBM50031827
Substrate/Competitorn/a
Meas. Tech.ChEMBL_1437890 (CHEMBL3384854)
Ki 30±n/a nM
Citation Chang, LLee, SYLeonczak, PRozenski, JDe Jonghe, SHanck, TMüller, CEHerdewijn, P Imidazopyridine- and purine-thioacetamide derivatives: potent inhibitors of nucleotide pyrophosphatase/phosphodiesterase 1 (NPP1). J Med Chem57:10080-100 (2014) 
 
Ectonucleotide pyrophosphatase/phosphodiesterase family member 1
Name:Ectonucleotide pyrophosphatase/phosphodiesterase family member 1
Type:PROTEIN
Mol. Mass.:104934.43
Organism:Homo sapiens (Human)
Description:ChEMBL_1448940
Residue:925
BDBM50031827
NameBDBM50031827
Synonyms:CHEMBL3360884
TypeSmall organic molecule
Emp. Form.C17H18N4O4S
Mol. Mass.374.414
SMILESCOc1ccc2nc(SCC(=O)Nc3ccc(OC)c(OC)c3)[nH]c2n1