Reaction Details
TargetEctonucleotide pyrophosphatase/phosphodiesterase family member 1
LigandBDBM50031826
Substrate/Competitorn/a
Meas. Tech.ChEMBL_1437888 (CHEMBL3384852)
Ki 127±n/a nM
Citation Chang, LLee, SYLeonczak, PRozenski, JDe Jonghe, SHanck, TMüller, CEHerdewijn, P Imidazopyridine- and purine-thioacetamide derivatives: potent inhibitors of nucleotide pyrophosphatase/phosphodiesterase 1 (NPP1). J Med Chem57:10080-100 (2014) 
 
Ectonucleotide pyrophosphatase/phosphodiesterase family member 1
Name:Ectonucleotide pyrophosphatase/phosphodiesterase family member 1
Type:PROTEIN
Mol. Mass.:104934.43
Organism:Homo sapiens (Human)
Description:ChEMBL_1448940
Residue:925
BDBM50031826
NameBDBM50031826
Synonyms:CHEMBL3360885
TypeSmall organic molecule
Emp. Form.C17H18N4O3S
Mol. Mass.358.415
SMILESCOc1ccc(NC(=O)CSc2nc3c(C)ccnc3[nH]2)cc1OC