Reaction Details
TargetEctonucleotide pyrophosphatase/phosphodiesterase family member 1
LigandBDBM50031831
Substrate/Competitorn/a
Meas. Tech.ChEMBL_1437888 (CHEMBL3384852)
Ki 281±n/a nM
Citation Chang, LLee, SYLeonczak, PRozenski, JDe Jonghe, SHanck, TMüller, CEHerdewijn, P Imidazopyridine- and purine-thioacetamide derivatives: potent inhibitors of nucleotide pyrophosphatase/phosphodiesterase 1 (NPP1). J Med Chem57:10080-100 (2014) 
 
Ectonucleotide pyrophosphatase/phosphodiesterase family member 1
Name:Ectonucleotide pyrophosphatase/phosphodiesterase family member 1
Type:PROTEIN
Mol. Mass.:104934.43
Organism:Homo sapiens (Human)
Description:ChEMBL_1448940
Residue:925
BDBM50031831
NameBDBM50031831
Synonyms:CHEMBL3360879
TypeSmall organic molecule
Emp. Form.C15H15N5O3S
Mol. Mass.345.376
SMILESCOc1ccc(NC(=O)CSc2nc3cncnc3[nH]2)cc1OC