Reaction Details
TargetTyrosine-protein phosphatase non-receptor type 22
LigandBDBM50031908
Substrate/Competitorn/a
Meas. Tech.ChEMBL_1437898 (CHEMBL3384862)
Ki 9970±n/a nM
Citation Hou, XLi, RLi, KYu, XSun, JPFang, H Fast identification of novel lymphoid tyrosine phosphatase inhibitors using target-ligand interaction-based virtual screening. J Med Chem57:9309-22 (2014) 
 
Tyrosine-protein phosphatase non-receptor type 22
Name:Tyrosine-protein phosphatase non-receptor type 22
Type:n/a
Mol. Mass.:91712.31
Organism:Homo sapiens (Human)
Description:Q9Y2R2
Residue:807
BDBM50031908
NameBDBM50031908
Synonyms:CHEMBL3360906
TypeSmall organic molecule
Emp. Form.C27H19N5O3S4
Mol. Mass.589.731
SMILESCc1cccc(CSc2nnc(NC(=O)CSc3nc4ccc(cc4s3)N3C(=O)c4ccccc4C3=O)s2)c1