Reaction Details
TargetTyrosine-protein phosphatase non-receptor type 22
LigandBDBM50031911
Substrate/Competitorn/a
Meas. Tech.ChEMBL_1437897 (CHEMBL3384861)
Ki 40980±n/a nM
Citation Hou, XLi, RLi, KYu, XSun, JPFang, H Fast identification of novel lymphoid tyrosine phosphatase inhibitors using target-ligand interaction-based virtual screening. J Med Chem57:9309-22 (2014) 
 
Tyrosine-protein phosphatase non-receptor type 22
Name:Tyrosine-protein phosphatase non-receptor type 22
Type:n/a
Mol. Mass.:91712.31
Organism:Homo sapiens (Human)
Description:Q9Y2R2
Residue:807
BDBM50031911
NameBDBM50031911
Synonyms:CHEMBL1299903
TypeSmall organic molecule
Emp. Form.C25H25NO6
Mol. Mass.435.4691
SMILESCCCCOc1cccc(c1)C1N(Cc2ccco2)C(=O)C(O)=C1C(=O)c1ccc(C)o1