Reaction Details
TargetTyrosine-protein phosphatase non-receptor type 22
LigandBDBM50031906
Substrate/Competitorn/a
Meas. Tech.ChEMBL_1438621 (CHEMBL3386726)
EC50 6490±n/a nM
Citation Hou, XLi, RLi, KYu, XSun, JPFang, H Fast identification of novel lymphoid tyrosine phosphatase inhibitors using target-ligand interaction-based virtual screening. J Med Chem57:9309-22 (2014) 
 
Tyrosine-protein phosphatase non-receptor type 22
Name:Tyrosine-protein phosphatase non-receptor type 22
Type:n/a
Mol. Mass.:91712.31
Organism:Homo sapiens (Human)
Description:Q9Y2R2
Residue:807
BDBM50031906
NameBDBM50031906
Synonyms:CHEMBL3360905
TypeSmall organic molecule
Emp. Form.C33H31N3O6S
Mol. Mass.597.681
SMILESCCOC(=O)C1=C(C)N=c2s\c(=C\c3ccc(OCc4ccc(cc4)C(O)=O)cc3)c(=O)n2C1c1ccc(cc1)N(C)C