Reaction Details
TargetATP-dependent translocase ABCB1
LigandBDBM50032261
Substrate/Competitorn/a
Meas. Tech.ChEMBL_1439392 (CHEMBL3389757)
EC50 69±n/a nM
Citation Capparelli, EZinzi, LCantore, MContino, MPerrone, MGLuurtsema, GBerardi, FPerrone, RColabufo, NA SAR studies on tetrahydroisoquinoline derivatives: the role of flexibility and bioisosterism to raise potency and selectivity toward P-glycoprotein. J Med Chem57:9983-94 (2014) 
 
ATP-dependent translocase ABCB1
Name:ATP-dependent translocase ABCB1
Type:Protein
Mol. Mass.:141503.50
Organism:Homo sapiens (Human)
Description:P08183
Residue:1280
BDBM50032261
NameBDBM50032261
Synonyms:CHEMBL3352989
TypeSmall organic molecule
Emp. Form.C26H29NO3
Mol. Mass.403.5134
SMILESCOc1cccc(c1)-c1ccccc1CCN1CCc2cc(OC)c(OC)cc2C1