Reaction Details
TargetHistone deacetylase 3
LigandBDBM50032267
Substrate/Competitorn/a
Meas. Tech.ChEMBL_1440126 (CHEMBL3382539)
Ki 500±n/a nM
Citation Maolanon, ARVilladsen, JSChristensen, NJHoeck, CFriis, THarris, PGotfredsen, CHFristrup, POlsen, CA Methyl effect in azumamides provides insight into histone deacetylase inhibition by macrocycles. J Med Chem57:9644-57 (2014) 
 
Histone deacetylase 3
Name:Histone deacetylase 3
Type:Enzyme
Mol. Mass.:48829.55
Organism:Homo sapiens (Human)
Description:O15379
Residue:428
BDBM50032267
NameBDBM50032267
Synonyms:CHEMBL3352997
TypeSmall organic molecule
Emp. Form.C28H37N5O6
Mol. Mass.539.6233
SMILESCC(C)[C@H]1NC(=O)C[C@@H](C\C=C/CCC(O)=O)NC(=O)[C@@H](Cc2c[nH]c3ccccc23)NC(=O)[C@@H](C)NC1=O