Reaction Details
TargetPolyamine deacetylase HDAC10
LigandBDBM50032270
Substrate/Competitorn/a
Meas. Tech.ChEMBL_1440129 (CHEMBL3382542)
Ki 170±n/a nM
Citation Maolanon, ARVilladsen, JSChristensen, NJHoeck, CFriis, THarris, PGotfredsen, CHFristrup, POlsen, CA Methyl effect in azumamides provides insight into histone deacetylase inhibition by macrocycles. J Med Chem57:9644-57 (2014) 
 
Polyamine deacetylase HDAC10
Name:Polyamine deacetylase HDAC10
Type:Chromatin regulator; hydrolase; repressor
Mol. Mass.:71431.89
Organism:Homo sapiens (Human)
Description:Q969S8
Residue:669
BDBM50032270
NameBDBM50032270
Synonyms:CHEMBL3352995
TypeSmall organic molecule
Emp. Form.C28H39N5O6
Mol. Mass.541.6392
SMILESCC(C)[C@H]1NC(=O)C[C@@H](CCCCCC(O)=O)NC(=O)[C@@H](Cc2c[nH]c3ccccc23)NC(=O)[C@@H](C)NC1=O