Reaction Details
TargetHistone deacetylase 11
LigandBDBM50032267
Substrate/Competitorn/a
Meas. Tech.ChEMBL_1440130 (CHEMBL3382543)
Ki 900±n/a nM
Citation Maolanon, ARVilladsen, JSChristensen, NJHoeck, CFriis, THarris, PGotfredsen, CHFristrup, POlsen, CA Methyl effect in azumamides provides insight into histone deacetylase inhibition by macrocycles. J Med Chem57:9644-57 (2014) 
 
Histone deacetylase 11
Name:Histone deacetylase 11
Type:Chromatin regulator; hydrolase; repressor
Mol. Mass.:39187.66
Organism:Homo sapiens (Human)
Description:Q96DB2
Residue:347
BDBM50032267
NameBDBM50032267
Synonyms:CHEMBL3352997
TypeSmall organic molecule
Emp. Form.C28H37N5O6
Mol. Mass.539.6233
SMILESCC(C)[C@H]1NC(=O)C[C@@H](C\C=C/CCC(O)=O)NC(=O)[C@@H](Cc2c[nH]c3ccccc23)NC(=O)[C@@H](C)NC1=O