Reaction Details
TargetHistone deacetylase 11
LigandBDBM19149
Substrate/Competitorn/a
Meas. Tech.ChEMBL_1440130 (CHEMBL3382543)
Ki 13±n/a nM
Citation Maolanon, ARVilladsen, JSChristensen, NJHoeck, CFriis, THarris, PGotfredsen, CHFristrup, POlsen, CA Methyl effect in azumamides provides insight into histone deacetylase inhibition by macrocycles. J Med Chem57:9644-57 (2014) 
 
Histone deacetylase 11
Name:Histone deacetylase 11
Type:Chromatin regulator; hydrolase; repressor
Mol. Mass.:39187.66
Organism:Homo sapiens (Human)
Description:Q96DB2
Residue:347
BDBM19149
NameBDBM19149
Synonyms:CHEMBL98 SAHA US10188756, Compound SAHA US11505523, Compound SAHA US9353061, SAHA US9695181, Vorinostat Zolinza suberoylanilide hydroxamic acid
TypeSmall organic molecule
Emp. Form.C14H20N2O3
Mol. Mass.264.3202
SMILESONC(=O)CCCCCCC(=O)Nc1ccccc1