Reaction Details
TargetHistone deacetylase 1
LigandBDBM50032273
Substrate/Competitorn/a
Meas. Tech.ChEMBL_1440124 (CHEMBL3382537)
Ki 900±n/a nM
Citation Maolanon, ARVilladsen, JSChristensen, NJHoeck, CFriis, THarris, PGotfredsen, CHFristrup, POlsen, CA Methyl effect in azumamides provides insight into histone deacetylase inhibition by macrocycles. J Med Chem57:9644-57 (2014) 
 
Histone deacetylase 1
Name:Histone deacetylase 1
Type:Enzyme
Mol. Mass.:55090.27
Organism:Homo sapiens (Human)
Description:Q13547
Residue:482
BDBM50032273
NameBDBM50032273
Synonyms:CHEMBL3352993
TypeSmall organic molecule
Emp. Form.C26H38N4O6
Mol. Mass.502.6031
SMILESCC(C)[C@H]1NC(=O)C[C@@H](CCCCCC(O)=O)NC(=O)[C@@H](Cc2ccccc2)NC(=O)[C@@H](C)NC1=O