Reaction Details
TargetHistone deacetylase 3
LigandBDBM50032272
Substrate/Competitorn/a
Meas. Tech.ChEMBL_1440126 (CHEMBL3382539)
Ki 200±n/a nM
Citation Maolanon, ARVilladsen, JSChristensen, NJHoeck, CFriis, THarris, PGotfredsen, CHFristrup, POlsen, CA Methyl effect in azumamides provides insight into histone deacetylase inhibition by macrocycles. J Med Chem57:9644-57 (2014) 
 
Histone deacetylase 3
Name:Histone deacetylase 3
Type:Enzyme
Mol. Mass.:48829.55
Organism:Homo sapiens (Human)
Description:O15379
Residue:428
BDBM50032272
NameBDBM50032272
Synonyms:CHEMBL3352994
TypeSmall organic molecule
Emp. Form.C26H38N4O7
Mol. Mass.518.6025
SMILESCC(C)[C@H]1NC(=O)C[C@@H](CCCCCC(O)=O)NC(=O)[C@@H](Cc2ccc(O)cc2)NC(=O)[C@@H](C)NC1=O