Reaction Details
TargetHigh affinity cAMP-specific 3',5'-cyclic phosphodiesterase 7A
LigandBDBM50032602
Substrate/Competitorn/a
Meas. Tech.ChEMBL_1440940 (CHEMBL3375790)
IC50 7.3±n/a nM
Citation Kawai, KEndo, YAsano, TAmano, SSawada, KUeo, NTakahashi, NSonoda, YNagai, MKamei, NNagata, N Discovery of 2-(cyclopentylamino)thieno[3,2-d]pyrimidin-4(3H)-one derivatives as a new series of potent phosphodiesterase 7 inhibitors. J Med Chem57:9844-54 (2014) 
 
High affinity cAMP-specific 3',5'-cyclic phosphodiesterase 7A
Name:High affinity cAMP-specific 3',5'-cyclic phosphodiesterase 7A
Type:Enzyme
Mol. Mass.:55514.96
Organism:Homo sapiens (Human)
Description:Q13946
Residue:482
BDBM50032602
NameBDBM50032602
Synonyms:CHEMBL3354173
TypeSmall organic molecule
Emp. Form.C20H24N4OS
Mol. Mass.368.496
SMILESCCn1c(NC2CCCC2)nc2c(CCc3cccnc3)csc2c1=O