Reaction Details
TargetcAMP-specific 3',5'-cyclic phosphodiesterase 4B
LigandBDBM50032592
Substrate/Competitorn/a
Meas. Tech.ChEMBL_1440941 (CHEMBL3375791)
IC50 3000±n/a nM
Citation Kawai, KEndo, YAsano, TAmano, SSawada, KUeo, NTakahashi, NSonoda, YNagai, MKamei, NNagata, N Discovery of 2-(cyclopentylamino)thieno[3,2-d]pyrimidin-4(3H)-one derivatives as a new series of potent phosphodiesterase 7 inhibitors. J Med Chem57:9844-54 (2014) 
 
cAMP-specific 3',5'-cyclic phosphodiesterase 4B
Name:cAMP-specific 3',5'-cyclic phosphodiesterase 4B
Type:Protein
Mol. Mass.:83318.87
Organism:Homo sapiens (Human)
Description:Q07343
Residue:736
BDBM50032592
NameBDBM50032592
Synonyms:CHEMBL3354169
TypeSmall organic molecule
Emp. Form.C15H17N3OS
Mol. Mass.287.38
SMILESCCn1c(NC2CCCC2)nc2c(csc2c1=O)C#C