Reaction Details
TargetcAMP-specific 3',5'-cyclic phosphodiesterase 4B
LigandBDBM50032601
Substrate/Competitorn/a
Meas. Tech.ChEMBL_1440941 (CHEMBL3375791)
IC50 820±n/a nM
Citation Kawai, KEndo, YAsano, TAmano, SSawada, KUeo, NTakahashi, NSonoda, YNagai, MKamei, NNagata, N Discovery of 2-(cyclopentylamino)thieno[3,2-d]pyrimidin-4(3H)-one derivatives as a new series of potent phosphodiesterase 7 inhibitors. J Med Chem57:9844-54 (2014) 
 
cAMP-specific 3',5'-cyclic phosphodiesterase 4B
Name:cAMP-specific 3',5'-cyclic phosphodiesterase 4B
Type:Protein
Mol. Mass.:83318.87
Organism:Homo sapiens (Human)
Description:Q07343
Residue:736
BDBM50032601
NameBDBM50032601
Synonyms:CHEMBL3354172
TypeSmall organic molecule
Emp. Form.C20H26N4O2S
Mol. Mass.386.511
SMILESCCn1c(NC2CCCC2)nc2c(csc2c1=O)C#CCN1CCOCC1