Reaction Details
TargetNAD-dependent protein deacetylase sirtuin-2
LigandBDBM50032647
Substrate/Competitorn/a
Meas. Tech.ChEMBL_1440978 (CHEMBL3375828)
IC50 28700±n/a nM
Citation Seifert, TMalo, MKokkola, TEngen, KFridén-Saxin, MWallén, EALahtela-Kakkonen, MJarho, EMLuthman, K Chroman-4-one- and chromone-based sirtuin 2 inhibitors with antiproliferative properties in cancer cells. J Med Chem57:9870-88 (2014) 
 
NAD-dependent protein deacetylase sirtuin-2
Name:NAD-dependent protein deacetylase sirtuin-2
Type:Hydrolase
Mol. Mass.:43172.62
Organism:Homo sapiens (Human)
Description:n/a
Residue:389
BDBM50032647
NameBDBM50032647
Synonyms:CHEMBL3354221
TypeSmall organic molecule
Emp. Form.C19H15BrClNO3
Mol. Mass.420.684
SMILESCC(=O)Nc1c(CCc2ccccc2)oc2c(Br)cc(Cl)cc2c1=O