Reaction Details
TargetNAD-dependent protein deacetylase sirtuin-2
LigandBDBM50395320
Substrate/Competitorn/a
Meas. Tech.ChEMBL_1440978 (CHEMBL3375828)
IC50 1500±n/a nM
Citation Seifert, TMalo, MKokkola, TEngen, KFridén-Saxin, MWallén, EALahtela-Kakkonen, MJarho, EMLuthman, K Chroman-4-one- and chromone-based sirtuin 2 inhibitors with antiproliferative properties in cancer cells. J Med Chem57:9870-88 (2014) 
 
NAD-dependent protein deacetylase sirtuin-2
Name:NAD-dependent protein deacetylase sirtuin-2
Type:Hydrolase
Mol. Mass.:43172.62
Organism:Homo sapiens (Human)
Description:n/a
Residue:389
BDBM50395320
NameBDBM50395320
Synonyms:CHEMBL2164016
TypeSmall organic molecule
Emp. Form.C14H16BrClO2
Mol. Mass.331.633
SMILESCCCCC[C@H]1CC(=O)c2cc(Cl)cc(Br)c2O1