Reaction Details
TargetPotassium voltage-gated channel subfamily H member 2
LigandBDBM50032726
Substrate/Competitorn/a
Meas. Tech.ChEMBL_1442553 (CHEMBL3372246)
Ki 496±n/a nM
Citation Epstein, OBryan, MCCheng, ACDerakhchan, KDineen, TAHickman, DHua, ZHuman, JBKreiman, CMarx, IEWeiss, MMWahl, RCWen, PHWhittington, DAWood, SZheng, XMFremeau, RTWhite, RDPatel, VF Lead optimization and modulation of hERG activity in a series of aminooxazoline xantheneß-site amyloid precursor protein cleaving enzyme (BACE1) inhibitors. J Med Chem57:9796-810 (2014) 
 
Potassium voltage-gated channel subfamily H member 2
Name:Potassium voltage-gated channel subfamily H member 2
Type:Multi-pass membrane protein
Mol. Mass.:126672.65
Organism:Homo sapiens (Human)
Description:Q12809
Residue:1159
BDBM50032726
NameBDBM50032726
Synonyms:CHEMBL3354702
TypeSmall organic molecule
Emp. Form.C25H25N3O3
Mol. Mass.415.4843
SMILESCC(C)(C)COc1ccc2Oc3ccc(cc3[C@@]3(COC(N)=N3)c2c1)-c1ccccn1