Reaction Details
TargetPotassium voltage-gated channel subfamily H member 2
LigandBDBM50032737
Substrate/Competitorn/a
Meas. Tech.ChEMBL_1442553 (CHEMBL3372246)
Ki 3280±n/a nM
Citation Epstein, OBryan, MCCheng, ACDerakhchan, KDineen, TAHickman, DHua, ZHuman, JBKreiman, CMarx, IEWeiss, MMWahl, RCWen, PHWhittington, DAWood, SZheng, XMFremeau, RTWhite, RDPatel, VF Lead optimization and modulation of hERG activity in a series of aminooxazoline xantheneß-site amyloid precursor protein cleaving enzyme (BACE1) inhibitors. J Med Chem57:9796-810 (2014) 
 
Potassium voltage-gated channel subfamily H member 2
Name:Potassium voltage-gated channel subfamily H member 2
Type:Multi-pass membrane protein
Mol. Mass.:126672.65
Organism:Homo sapiens (Human)
Description:Q12809
Residue:1159
BDBM50032737
NameBDBM50032737
Synonyms:CHEMBL3354718
TypeSmall organic molecule
Emp. Form.C25H19F2N3O3
Mol. Mass.447.4335
SMILESNC1=N[C@@]2(CO1)c1cc(ccc1Oc1c(F)cc(cc21)C1=CCOCC1)-c1cccnc1F