Reaction Details
TargetMitogen-activated protein kinase 10
LigandBDBM50032816
Substrate/Competitorn/a
Meas. Tech.ChEMBL_1442572 (CHEMBL3372265)
IC50 38±n/a nM
Citation Zheng, KIqbal, SHernandez, PPark, HLoGrasso, PVFeng, Y Design and synthesis of highly potent and isoform selective JNK3 inhibitors: SAR studies on aminopyrazole derivatives. J Med Chem57:10013-30 (2014) 
 
Mitogen-activated protein kinase 10
Name:Mitogen-activated protein kinase 10
Type:Enzyme
Mol. Mass.:52586.89
Organism:Homo sapiens (Human)
Description:n/a
Residue:464
BDBM50032816
NameBDBM50032816
Synonyms:CHEMBL3355146
TypeSmall organic molecule
Emp. Form.C23H19ClN6O2
Mol. Mass.446.889
SMILESCc1ccc(NC(=O)c2cccc(c2)-n2cc(NC(=O)Nc3ccccc3Cl)cn2)cn1