Reaction Details
TargetMitogen-activated protein kinase 10
LigandBDBM50032821
Substrate/Competitorn/a
Meas. Tech.ChEMBL_1442572 (CHEMBL3372265)
IC50<1.000000±n/a nM
Citation Zheng, KIqbal, SHernandez, PPark, HLoGrasso, PVFeng, Y Design and synthesis of highly potent and isoform selective JNK3 inhibitors: SAR studies on aminopyrazole derivatives. J Med Chem57:10013-30 (2014) 
 
Mitogen-activated protein kinase 10
Name:Mitogen-activated protein kinase 10
Type:Enzyme
Mol. Mass.:52586.89
Organism:Homo sapiens (Human)
Description:n/a
Residue:464
BDBM50032821
NameBDBM50032821
Synonyms:CHEMBL3355178
TypeSmall organic molecule
Emp. Form.C24H23ClN8O2
Mol. Mass.490.945
SMILESClc1ccccc1NC(=O)Nc1cnn(c1)-c1cccc(c1)C(=O)Nc1cnn(c1)C1CCNC1