Reaction Details
TargetMitogen-activated protein kinase 9
LigandBDBM50032749
Substrate/Competitorn/a
Meas. Tech.ChEMBL_1442577 (CHEMBL3372270)
IC50 25±n/a nM
Citation Zheng, KIqbal, SHernandez, PPark, HLoGrasso, PVFeng, Y Design and synthesis of highly potent and isoform selective JNK3 inhibitors: SAR studies on aminopyrazole derivatives. J Med Chem57:10013-30 (2014) 
 
Mitogen-activated protein kinase 9
Name:Mitogen-activated protein kinase 9
Type:Enzyme
Mol. Mass.:48131.49
Organism:Homo sapiens (Human)
Description:JNK-2 was purchased from Upstate Cell Signaling Solutions (formerly Upstate Biotechnology).
Residue:424
BDBM50032749
NameBDBM50032749
Synonyms:CHEMBL3355177
TypeSmall organic molecule
Emp. Form.C25H25ClN8O2
Mol. Mass.504.971
SMILESClc1ccccc1NC(=O)Nc1cnn(c1)-c1cccc(c1)C(=O)Nc1cnn(c1)C1CCNCC1