Reaction Details
TargetCoagulation factor XI
LigandBDBM50032860
Substrate/Competitorn/a
Meas. Tech.ChEMBL_1443463 (CHEMBL3377177)
Ki 630±n/a nM
Citation Hangeland, JJFriends, TJRossi, KASmallheer, JMWang, CSun, ZCorte, JRFang, TWong, PCRendina, ARBarbera, FABozarth, JMLuettgen, JMWatson, CAZhang, GWei, ARamamurthy, VMorin, PEBisacchi, GSSubramaniam, SArunachalam, PMathur, ASeiffert, DAWexler, RRQuan, ML Phenylimidazoles as potent and selective inhibitors of coagulation factor XIa with in vivo antithrombotic activity. J Med Chem57:9915-32 (2014) 
 
Coagulation factor XI
Name:Coagulation factor XI
Type:Enzyme
Mol. Mass.:70130.58
Organism:Homo sapiens (Human)
Description:P03951
Residue:625
BDBM50032860
NameBDBM50032860
Synonyms:CHEMBL3355669
TypeSmall organic molecule
Emp. Form.C31H37F3N4O5
Mol. Mass.602.6445
SMILESOC(=O)C(F)(F)F.CCOC(=O)Cc1cccc(c1)-c1c[nH]c(n1)[C@H](Cc1ccccc1)NC(=O)[C@H]1CC[C@H](CN)CC1