Reaction Details
TargetPeregrin
LigandBDBM50032917
Substrate/Competitorn/a
Meas. Tech.ChEMBL_1431805 (CHEMBL3385101)
IC50 100±n/a nM
Citation Demont, EHBamborough, PChung, CWCraggs, PDFallon, DGordon, LJGrandi, PHobbs, CIHussain, JJones, EJLe Gall, AMichon, AMMitchell, DJPrinjha, RKRoberts, ADSheppard, RJWatson, RJ 1,3-Dimethyl Benzimidazolones Are Potent, Selective Inhibitors of the BRPF1 Bromodomain. ACS Med Chem Lett5:1190-5 (2014) 
 
Peregrin
Name:Peregrin
Type:PROTEIN
Mol. Mass.:137524.47
Organism:Homo sapiens (Human)
Description:ChEMBL_108054
Residue:1214
BDBM50032917
NameBDBM50032917
Synonyms:CHEMBL1724375
TypeSmall organic molecule
Emp. Form.C21H24N4O2
Mol. Mass.364.4409
SMILESCn1c2cc(NC(=O)c3ccccc3)c(cc2n(C)c1=O)N1CCCCC1