Reaction Details
TargetHepatocyte growth factor activator
LigandBDBM50032931
Substrate/Competitorn/a
Meas. Tech.ChEMBL_1432690 (CHEMBL3389934)
Ki 60±n/a nM
Citation Han, ZHarris, PKJones, DEChugani, RKim, TAgarwal, MShen, WWildman, SAJanetka, JW Inhibitors of HGFA, Matriptase, and Hepsin Serine Proteases: A Nonkinase Strategy to Block Cell Signaling in Cancer. ACS Med Chem Lett5:1219-24 (2014) 
 
Hepatocyte growth factor activator
Name:Hepatocyte growth factor activator
Type:PROTEIN
Mol. Mass.:70690.18
Organism:Homo sapiens (Human)
Description:ChEMBL_109514
Residue:655
BDBM50032931
NameBDBM50032931
Synonyms:CHEMBL3356594
TypeSmall organic molecule
Emp. Form.C28H48N12O6S
Mol. Mass.680.823
SMILESCC(C)C[C@H](NC(=O)[C@H](CCC(N)=O)NC(=O)[C@H](CCCNC(N)=N)NC(C)=O)C(=O)N[C@@H](CCCNC(N)=N)C(=O)c1nccs1