Reaction Details
TargetHepatocyte growth factor activator
LigandBDBM50032932
Substrate/Competitorn/a
Meas. Tech.ChEMBL_1432690 (CHEMBL3389934)
Ki 80±n/a nM
Citation Han, ZHarris, PKJones, DEChugani, RKim, TAgarwal, MShen, WWildman, SAJanetka, JW Inhibitors of HGFA, Matriptase, and Hepsin Serine Proteases: A Nonkinase Strategy to Block Cell Signaling in Cancer. ACS Med Chem Lett5:1219-24 (2014) 
 
Hepatocyte growth factor activator
Name:Hepatocyte growth factor activator
Type:PROTEIN
Mol. Mass.:70690.18
Organism:Homo sapiens (Human)
Description:ChEMBL_109514
Residue:655
BDBM50032932
NameBDBM50032932
Synonyms:CHEMBL3356593
TypeSmall organic molecule
Emp. Form.C32H49N9O5S
Mol. Mass.671.854
SMILESCC(C)C[C@H](NC(=O)[C@H](Cc1ccccc1)NC(=O)[C@H](CCCCN)NC(C)=O)C(=O)N[C@@H](CCCNC(N)=N)C(=O)c1nccs1