Reaction Details
TargetSerine protease hepsin
LigandBDBM50032933
Substrate/Competitorn/a
Meas. Tech.ChEMBL_1432692 (CHEMBL3389936)
Ki 0.580000±n/a nM
Citation Han, ZHarris, PKJones, DEChugani, RKim, TAgarwal, MShen, WWildman, SAJanetka, JW Inhibitors of HGFA, Matriptase, and Hepsin Serine Proteases: A Nonkinase Strategy to Block Cell Signaling in Cancer. ACS Med Chem Lett5:1219-24 (2014) 
 
Serine protease hepsin
Name:Serine protease hepsin
Type:Enzyme
Mol. Mass.:45016.98
Organism:Homo sapiens (Human)
Description:Human deglycosylated hepsin was expressed in Pichia pastoris.
Residue:417
BDBM50032933
NameBDBM50032933
Synonyms:CHEMBL3356592
TypeSmall organic molecule
Emp. Form.C31H46N10O6S
Mol. Mass.686.825
SMILESCC(=O)N[C@@H](CCCCN)C(=O)N[C@@H](CCC(N)=O)C(=O)N[C@@H](Cc1ccccc1)C(=O)N[C@@H](CCCNC(N)=N)C(=O)c1nccs1