Reaction Details
TargetSerine protease hepsin
LigandBDBM50032944
Substrate/Competitorn/a
Meas. Tech.ChEMBL_1432692 (CHEMBL3389936)
Ki 0.680000±n/a nM
Citation Han, ZHarris, PKJones, DEChugani, RKim, TAgarwal, MShen, WWildman, SAJanetka, JW Inhibitors of HGFA, Matriptase, and Hepsin Serine Proteases: A Nonkinase Strategy to Block Cell Signaling in Cancer. ACS Med Chem Lett5:1219-24 (2014) 
 
Serine protease hepsin
Name:Serine protease hepsin
Type:Enzyme
Mol. Mass.:45016.98
Organism:Homo sapiens (Human)
Description:Human deglycosylated hepsin was expressed in Pichia pastoris.
Residue:417
BDBM50032944
NameBDBM50032944
Synonyms:CHEMBL3356603
TypeSmall organic molecule
Emp. Form.C26H45N11O6S
Mol. Mass.639.771
SMILESCC(C)C[C@H](NC(=O)[C@H](CCCNC(N)=N)NC(=O)[C@H](CO)NC(C)=O)C(=O)N[C@@H](CCCNC(N)=N)C(=O)c1nccs1