Reaction Details
TargetHepatocyte growth factor activator
LigandBDBM50032945
Substrate/Competitorn/a
Meas. Tech.ChEMBL_1432690 (CHEMBL3389934)
Ki 103±n/a nM
Citation Han, ZHarris, PKJones, DEChugani, RKim, TAgarwal, MShen, WWildman, SAJanetka, JW Inhibitors of HGFA, Matriptase, and Hepsin Serine Proteases: A Nonkinase Strategy to Block Cell Signaling in Cancer. ACS Med Chem Lett5:1219-24 (2014) 
 
Hepatocyte growth factor activator
Name:Hepatocyte growth factor activator
Type:PROTEIN
Mol. Mass.:70690.18
Organism:Homo sapiens (Human)
Description:ChEMBL_109514
Residue:655
BDBM50032945
NameBDBM50032945
Synonyms:CHEMBL3356604
TypeSmall organic molecule
Emp. Form.C27H47N9O6S
Mol. Mass.625.784
SMILESCC(C)C[C@H](NC(=O)[C@H](CCCCN)NC(=O)[C@@H](NC(C)=O)[C@@H](C)O)C(=O)N[C@@H](CCCNC(N)=N)C(=O)c1nccs1