Reaction Details
TargetCysteinyl leukotriene receptor 2
LigandBDBM50033094
Substrate/Competitorn/a
Meas. Tech.ChEMBL_1432711 (CHEMBL3390515)
IC50 0.870000±n/a nM
Citation Itadani, STakahashi, SIma, MSekiguchi, TFujita, MNakayama, YTakeuchi, J Discovery of Highly Potent Dual CysLT1 and CysLT2 Antagonist. ACS Med Chem Lett5:1230-4 (2014) 
 
Cysteinyl leukotriene receptor 2
Name:Cysteinyl leukotriene receptor 2
Type:Enzyme Catalytic Domain
Mol. Mass.:39657.52
Organism:Homo sapiens (Human)
Description:Leukotriene Cysteinyl 2 CYSLTR2 HUMAN::Q9NS75
Residue:346
BDBM50033094
NameBDBM50033094
Synonyms:CHEMBL3342964
TypeSmall organic molecule
Emp. Form.C30H32N2O7
Mol. Mass.532.5843
SMILESOC(=O)CCCN1C[C@H](Oc2c(NC(=O)c3ccc(OCCCCc4ccccc4)cc3)cccc12)C(O)=O