Reaction Details
TargetCysteinyl leukotriene receptor 1
LigandBDBM50033060
Substrate/Competitorn/a
Meas. Tech.ChEMBL_1432710 (CHEMBL3389954)
IC50 1.4±n/a nM
Citation Itadani, STakahashi, SIma, MSekiguchi, TFujita, MNakayama, YTakeuchi, J Discovery of Highly Potent Dual CysLT1 and CysLT2 Antagonist. ACS Med Chem Lett5:1230-4 (2014) 
 
Cysteinyl leukotriene receptor 1
Name:Cysteinyl leukotriene receptor 1
Type:Enzyme Catalytic Domain
Mol. Mass.:38565.16
Organism:Homo sapiens (Human)
Description:Leukotriene Cysteinyl 1 CYSLTR1 HUMAN::Q9Y271
Residue:337
BDBM50033060
NameBDBM50033060
Synonyms:CHEMBL3342952
TypeSmall organic molecule
Emp. Form.C30H30N2O8
Mol. Mass.546.5678
SMILESOC(=O)CCC(=O)N1CC(Oc2c(NC(=O)c3ccc(OCCCCc4ccccc4)cc3)cccc12)C(O)=O