Reaction Details
TargetToll-like receptor 9
LigandBDBM50033135
Substrate/Competitorn/a
Meas. Tech.ChEMBL_1433562 (CHEMBL3383964)
IC50 35±n/a nM
Citation Watanabe, MKasai, MTomizawa, HAoki, MEiho, KIsobe, YAsano, S Dihydropyrrolo[2,3-d]pyrimidines: Selective Toll-Like Receptor 9 Antagonists from Scaffold Morphing Efforts. ACS Med Chem Lett5:1235-9 (2014) 
 
Toll-like receptor 9
Name:Toll-like receptor 9
Type:Enzyme
Mol. Mass.:115889.91
Organism:Homo sapiens (Human)
Description:Q9NR96
Residue:1032
BDBM50033135
NameBDBM50033135
Synonyms:CHEMBL3356614
TypeSmall organic molecule
Emp. Form.C23H34N6O
Mol. Mass.410.5557
SMILESCN1CCN(CC1)c1ccc(cc1)-c1nc(C)c(C)c(NCCN2CCOCC2)n1