Reaction Details
TargetCytochrome P450 3A4
LigandBDBM50033375
Substrate/Competitorn/a
Meas. Tech.ChEMBL_1434289 (CHEMBL3385834)
IC50>10000±n/a nM
Citation Xia, GChen, WZhang, JShao, JZhang, YHuang, WZhang, LQi, WSun, XLi, BXiang, ZMa, CXu, JDeng, HLi, YLi, PMiao, HHan, JLiu, YShen, JYu, Y A chemical tuned strategy to develop novel irreversible EGFR-TK inhibitors with improved safety and pharmacokinetic profiles. J Med Chem57:9889-900 (2014) 
 
Cytochrome P450 3A4
Name:Cytochrome P450 3A4
Type:Enzyme
Mol. Mass.:57349.57
Organism:Homo sapiens (Human)
Description:n/a
Residue:503
BDBM50033375
NameBDBM50033375
Synonyms:CHEMBL3357635
TypeSmall organic molecule
Emp. Form.C24H24ClF2N5O2
Mol. Mass.487.929
SMILESCOc1cc2ncnc(Nc3ccc(F)c(Cl)c3)c2cc1NC(=O)C(\F)=C\CN1CCCCC1