Reaction Details
TargetEpidermal growth factor receptor
LigandBDBM50033373
Substrate/Competitorn/a
Meas. Tech.ChEMBL_1433615 (CHEMBL3385194)
IC50 0.160000±n/a nM
Citation Xia, GChen, WZhang, JShao, JZhang, YHuang, WZhang, LQi, WSun, XLi, BXiang, ZMa, CXu, JDeng, HLi, YLi, PMiao, HHan, JLiu, YShen, JYu, Y A chemical tuned strategy to develop novel irreversible EGFR-TK inhibitors with improved safety and pharmacokinetic profiles. J Med Chem57:9889-900 (2014) 
 
Epidermal growth factor receptor
Name:Epidermal growth factor receptor
Type:Receptor Kinase Domain
Mol. Mass.:134279.59
Organism:Homo sapiens (Human)
Description:P00533
Residue:1210
BDBM50033373
NameBDBM50033373
Synonyms:CHEMBL3357641
TypeSmall organic molecule
Emp. Form.C24H24ClF2N5O3
Mol. Mass.503.929
SMILESCN(C)C\C=C(/F)C(=O)Nc1cc2c(Nc3ccc(F)c(Cl)c3)ncnc2cc1O[C@H]1CCOC1