Reaction Details
TargetGlycylpeptide N-tetradecanoyltransferase 1
LigandBDBM50033478
Substrate/Competitorn/a
Meas. Tech.ChEMBL_1435039 (CHEMBL3387685)
IC50 8.0±n/a nM
Citation Brand, SNorcross, NRThompson, SHarrison, JRSmith, VCRobinson, DATorrie, LSMcElroy, SPHallyburton, INorval, SScullion, PStojanovski, LSimeons, FRvan Aalten, DFrearson, JABrenk, RFairlamb, AHFerguson, MAWyatt, PGGilbert, IHRead, KD Lead optimization of a pyrazole sulfonamide series of Trypanosoma brucei N-myristoyltransferase inhibitors: identification and evaluation of CNS penetrant compounds as potential treatments for stage 2 human African trypanosomiasis. J Med Chem57:9855-69 (2014) 
 
Glycylpeptide N-tetradecanoyltransferase 1
Name:Glycylpeptide N-tetradecanoyltransferase 1
Type:Enzyme
Mol. Mass.:56814.10
Organism:Homo sapiens (Human)
Description:P30419
Residue:496
BDBM50033478
NameBDBM50033478
Synonyms:CHEMBL3357695
TypeSmall organic molecule
Emp. Form.C20H28Cl2N4O2S
Mol. Mass.459.433
SMILESCc1nn(C)c(C)c1NS(=O)(=O)c1c(Cl)cc(CCCC2CCNCC2)cc1Cl