Reaction Details
TargetGlycylpeptide N-tetradecanoyltransferase 1
LigandBDBM50033619
Substrate/Competitorn/a
Meas. Tech.ChEMBL_1435039 (CHEMBL3387685)
IC50 8.0±n/a nM
Citation Brand, SNorcross, NRThompson, SHarrison, JRSmith, VCRobinson, DATorrie, LSMcElroy, SPHallyburton, INorval, SScullion, PStojanovski, LSimeons, FRvan Aalten, DFrearson, JABrenk, RFairlamb, AHFerguson, MAWyatt, PGGilbert, IHRead, KD Lead optimization of a pyrazole sulfonamide series of Trypanosoma brucei N-myristoyltransferase inhibitors: identification and evaluation of CNS penetrant compounds as potential treatments for stage 2 human African trypanosomiasis. J Med Chem57:9855-69 (2014) 
 
Glycylpeptide N-tetradecanoyltransferase 1
Name:Glycylpeptide N-tetradecanoyltransferase 1
Type:Enzyme
Mol. Mass.:56814.10
Organism:Homo sapiens (Human)
Description:P30419
Residue:496
BDBM50033619
NameBDBM50033619
Synonyms:CHEMBL3358122
TypeSmall organic molecule
Emp. Form.C21H30Cl2F2N4O2S
Mol. Mass.511.456
SMILESCN(C)CCCCCCc1cc(Cl)c(c(Cl)c1)S(=O)(=O)N(C(F)F)c1c(C)nn(C)c1C