Reaction Details
TargetFalcipain 2
LigandBDBM50033625
Substrate/Competitorn/a
Meas. Tech.ChEMBL_1435072 (CHEMBL3388289)
IC50 6.9±n/a nM
Citation Conroy, TGuo, JTElias, NCergol, KMGut, JLegac, JKhatoon, LLiu, YMcGowan, SRosenthal, PJHunt, NHPayne, RJ Synthesis of gallinamide A analogues as potent falcipain inhibitors and antimalarials. J Med Chem57:10557-63 (2014) 
 
Falcipain 2
Name:Falcipain 2
Type:Enzyme
Mol. Mass.:55912.60
Organism:Plasmodium falciparum
Description:Recombinant falcipain-2.
Residue:484
BDBM50033625
NameBDBM50033625
Synonyms:CHEMBL3352874
TypeSmall organic molecule
Emp. Form.C40H60F3N5O8
Mol. Mass.795.9283
SMILES[O-]C(=O)C(F)(F)F.CC(C)C[C@H](NC(=O)[C@H](CC(C)C)NC(=O)[C@H](C(C)C)[NH+](C)C)C(=O)N[C@@H](C)\C=C\C(=O)N1[C@@H](C(C)C)C(OCc2ccccc2)=CC1=O