Reaction Details
TargetFalcipain 2
LigandBDBM50033672
Substrate/Competitorn/a
Meas. Tech.ChEMBL_1435072 (CHEMBL3388289)
IC50>50000±n/a nM
Citation Conroy, TGuo, JTElias, NCergol, KMGut, JLegac, JKhatoon, LLiu, YMcGowan, SRosenthal, PJHunt, NHPayne, RJ Synthesis of gallinamide A analogues as potent falcipain inhibitors and antimalarials. J Med Chem57:10557-63 (2014) 
 
Falcipain 2
Name:Falcipain 2
Type:Enzyme
Mol. Mass.:55912.60
Organism:Plasmodium falciparum
Description:Recombinant falcipain-2.
Residue:484
BDBM50033672
NameBDBM50033672
Synonyms:CHEMBL3358138
TypeSmall organic molecule
Emp. Form.C42H68F3N7O8
Mol. Mass.856.0266
SMILES[O-]C(=O)C(F)(F)F.CC[C@H](C)[C@H]([NH+](C)C)C(=O)N[C@@H](CC(C)C)C(=O)N[C@@H](CC(C)C)C(=O)N[C@@H](C(C)C)C(=O)N[C@@H](C)\C=C\C(=O)N[C@@H](C)C(=O)NCc1ccccc1