Reaction Details
TargetFalcipain 2
LigandBDBM50033703
Substrate/Competitorn/a
Meas. Tech.ChEMBL_1435072 (CHEMBL3388289)
IC50 11500±n/a nM
Citation Conroy, TGuo, JTElias, NCergol, KMGut, JLegac, JKhatoon, LLiu, YMcGowan, SRosenthal, PJHunt, NHPayne, RJ Synthesis of gallinamide A analogues as potent falcipain inhibitors and antimalarials. J Med Chem57:10557-63 (2014) 
 
Falcipain 2
Name:Falcipain 2
Type:Enzyme
Mol. Mass.:55912.60
Organism:Plasmodium falciparum
Description:Recombinant falcipain-2.
Residue:484
BDBM50033703
NameBDBM50033703
Synonyms:CHEMBL3358134
TypeSmall organic molecule
Emp. Form.C36H57F3N6O7
Mol. Mass.742.869
SMILES[O-]C(=O)C(F)(F)F.CC(C)C[C@H](NC(=O)[C@H](CC(C)C)NC(=O)[C@H](C(C)C)[NH+](C)C)C(=O)N[C@@H](C)\C=C\C(=O)N[C@@H](C)C(=O)NCc1ccccc1