Reaction Details
TargetFalcipain 2
LigandBDBM50033708
Substrate/Competitorn/a
Meas. Tech.ChEMBL_1435072 (CHEMBL3388289)
IC50 2.8±n/a nM
Citation Conroy, TGuo, JTElias, NCergol, KMGut, JLegac, JKhatoon, LLiu, YMcGowan, SRosenthal, PJHunt, NHPayne, RJ Synthesis of gallinamide A analogues as potent falcipain inhibitors and antimalarials. J Med Chem57:10557-63 (2014) 
 
Falcipain 2
Name:Falcipain 2
Type:Enzyme
Mol. Mass.:55912.60
Organism:Plasmodium falciparum
Description:Recombinant falcipain-2.
Residue:484
BDBM50033708
NameBDBM50033708
Synonyms:CHEMBL3358129
TypeSmall organic molecule
Emp. Form.C32H54F3N5O8
Mol. Mass.693.7951
SMILES[O-]C(=O)C(F)(F)F.CO[C@H]1CC(=O)N([C@H]1C)C(=O)\C=C\[C@H](C)NC(=O)[C@H](CC(C)C)NC(=O)[C@H](CC(C)C)NC(=O)[C@H](C(C)C)[NH+](C)C