Reaction Details
TargetCollagenase 3
LigandBDBM50033807
Substrate/Competitorn/a
Meas. Tech.ChEMBL_1435763 (CHEMBL3388955)
IC50 4700±n/a nM
Citation Durham, TBKlimkowski, VJRito, CJMarimuthu, JToth, JLLiu, CDurbin, JDStout, SLAdams, LSwearingen, CLin, CChambers, MGThirunavukkarasu, KWiley, MR Identification of potent and selective hydantoin inhibitors of aggrecanase-1 and aggrecanase-2 that are efficacious in both chemical and surgical models of osteoarthritis. J Med Chem57:10476-85 (2014) 
 
Collagenase 3
Name:Collagenase 3
Type:Enzyme
Mol. Mass.:53808.06
Organism:Homo sapiens (Human)
Description:P45452
Residue:471
BDBM50033807
NameBDBM50033807
Synonyms:CHEMBL3358157
TypeSmall organic molecule
Emp. Form.C17H14ClN5O4
Mol. Mass.387.777
SMILESCn1nccc1[C@]1(CNC(=O)c2cc3cc(Cl)ccc3o2)NC(=O)NC1=O