Reaction Details
TargetA disintegrin and metalloproteinase with thrombospondin motifs 5
LigandBDBM50033809
Substrate/Competitorn/a
Meas. Tech.ChEMBL_1435759 (CHEMBL3388951)
IC50 350±n/a nM
Citation Durham, TBKlimkowski, VJRito, CJMarimuthu, JToth, JLLiu, CDurbin, JDStout, SLAdams, LSwearingen, CLin, CChambers, MGThirunavukkarasu, KWiley, MR Identification of potent and selective hydantoin inhibitors of aggrecanase-1 and aggrecanase-2 that are efficacious in both chemical and surgical models of osteoarthritis. J Med Chem57:10476-85 (2014) 
 
A disintegrin and metalloproteinase with thrombospondin motifs 5
Name:A disintegrin and metalloproteinase with thrombospondin motifs 5
Type:Enzyme
Mol. Mass.:101769.09
Organism:Homo sapiens (Human)
Description:Q9UNA0
Residue:930
BDBM50033809
NameBDBM50033809
Synonyms:CHEMBL3358151
TypeSmall organic molecule
Emp. Form.C13H14ClN3O4
Mol. Mass.311.721
SMILESC[C@]1(CNC(=O)COc2ccc(Cl)cc2)NC(=O)NC1=O