Reaction Details
Target72 kDa type IV collagenase
LigandBDBM50033819
Substrate/Competitorn/a
Meas. Tech.ChEMBL_1435761 (CHEMBL3388953)
IC50 2100±n/a nM
Citation Durham, TBKlimkowski, VJRito, CJMarimuthu, JToth, JLLiu, CDurbin, JDStout, SLAdams, LSwearingen, CLin, CChambers, MGThirunavukkarasu, KWiley, MR Identification of potent and selective hydantoin inhibitors of aggrecanase-1 and aggrecanase-2 that are efficacious in both chemical and surgical models of osteoarthritis. J Med Chem57:10476-85 (2014) 
 
72 kDa type IV collagenase
Name:72 kDa type IV collagenase
Type:Enzyme
Mol. Mass.:73870.36
Organism:Homo sapiens (Human)
Description: P08253
Residue:660
BDBM50033819
NameBDBM50033819
Synonyms:CHEMBL3358153
TypeSmall organic molecule
Emp. Form.C19H14ClN3O4
Mol. Mass.383.785
SMILESClc1ccc2oc(cc2c1)C(=O)NC[C@]1(NC(=O)NC1=O)c1ccccc1